Target
Hepatocyte growth factor receptor
Ligand
BDBM24760
Substrate
biotinylated gastrin substrate
Meas. Tech.
HTRF Kinase Inhibition Assay
pH
7.5±n/a
Temperature
295.15±n/a K
Ki
30±5 nM
Citation
 D'Angelo, NDBellon, SFBooker, SKCheng, YCoxon, ADominguez, CFellows, IHoffman, DHungate, RKaplan-Lefko, PLee, MRLi, CLiu, LRainbeau, EReider, PJRex, KSiegmund, ASun, YTasker, ASXi, NXu, SYang, YZhang, YBurgess, TLDussault, IKim, TS Design, synthesis, and biological evaluation of potent c-Met inhibitors. J Med Chem 51:5766-79 (2008)  
Target
Name:
Hepatocyte growth factor receptor
Synonyms:
Hepatocyte growth factor receptor Hepatocyte growth factor receptor (c-MET) MET Met proto-oncogene (hepatocyte growth factor receptor) Tyrosine-protein kinase Met (c-Met) c-Met kinase
Type:
Protein
Mol. Mass.:
155559.73
Organism:
Homo sapiens (Human)
Description:
P08581
Residue:
1390
  
Inhibitor
Name:
BDBM24760
Synonyms:
N-[(5-{4-[(6,7-dimethoxyquinolin-4-yl)oxy]-3-fluorophenyl}-1-methyl-6-oxo-1,6-dihydropyrimidin-2-yl)(phenyl)methyl]-2-(dimethylamino)acetamide | pyrimidone, 38
Type:
Small organic molecule
Emp. Form.:
C33H32FN5O5
Mol. Mass.:
597.6361
SMILES:
COc1cc2nccc(Oc3ccc(cc3F)-c3cnc(C(NC(=O)CN(C)C)c4ccccc4)n(C)c3=O)c2cc1OC
:
Substrate
Name:
biotinylated gastrin substrate
Synonyms:
Type:
Peptide
Mol. Mass.:
2100.22
Organism:
Description:
Residue:
17
ITINYLEEEEAYGWLDF