Target
Hepatocyte growth factor receptor
Ligand
BDBM24768
Substrate
biotinylated gastrin substrate
Meas. Tech.
HTRF Kinase Inhibition Assay
pH
7.5±n/a
Temperature
295.15±n/a K
Ki
14±1 nM
Citation
 D'Angelo, NDBellon, SFBooker, SKCheng, YCoxon, ADominguez, CFellows, IHoffman, DHungate, RKaplan-Lefko, PLee, MRLi, CLiu, LRainbeau, EReider, PJRex, KSiegmund, ASun, YTasker, ASXi, NXu, SYang, YZhang, YBurgess, TLDussault, IKim, TS Design, synthesis, and biological evaluation of potent c-Met inhibitors. J Med Chem 51:5766-79 (2008)  
Target
Name:
Hepatocyte growth factor receptor
Synonyms:
Hepatocyte growth factor receptor Hepatocyte growth factor receptor (c-MET) MET Met proto-oncogene (hepatocyte growth factor receptor) Tyrosine-protein kinase Met (c-Met) c-Met kinase
Type:
Protein
Mol. Mass.:
155559.73
Organism:
Homo sapiens (Human)
Description:
P08581
Residue:
1390
  
Inhibitor
Name:
BDBM24768
Synonyms:
5-{4-[(6,7-dimethoxyquinolin-4-yl)oxy]-3-fluorophenyl}-2-[(4-fluorophenyl)amino]-3-methyl-3,4-dihydropyrimidin-4-one | pyrimidone, 50
Type:
Small organic molecule
Emp. Form.:
C28H22F2N4O4
Mol. Mass.:
516.4955
SMILES:
COc1cc2nccc(Oc3ccc(cc3F)-c3cnc(Nc4ccc(F)cc4)n(C)c3=O)c2cc1OC
:
Substrate
Name:
biotinylated gastrin substrate
Synonyms:
Type:
Peptide
Mol. Mass.:
2100.22
Organism:
Description:
Residue:
17
ITINYLEEEEAYGWLDF