Target
Serine/threonine-protein kinase PLK3
Ligand
BDBM25113
Substrate
Biotinylated PLKtide
Meas. Tech.
PLK Kinase Assay
Ki
>20000±n/a nM
Citation
 Johnson, EFStewart, KDWoods, KWGiranda, VLLuo, Y Pharmacological and functional comparison of the polo-like kinase family: insight into inhibitor and substrate specificity. Biochemistry 46:9551-63 (2007)  
Target
Name:
Serine/threonine-protein kinase PLK3
Synonyms:
CNK FGF-inducible kinase PLK3 PRK Proliferation-related kinase | Serine/threonine-protein kinase PLK3
Type:
Serine/threonine-protein kinase
Mol. Mass.:
71655.17
Organism:
Homo sapiens (Human)
Description:
Enzyme assays were using PLK3 purified from baculovirus-infected Trichoplusia ni cells expressing full-length PLK3.
Residue:
646
  
Inhibitor
Name:
BDBM25113
Synonyms:
5-(4-aminophenyl)thieno[2,3-d]pyrimidin-4-amine | thienopyrimidine analogue, 1
Type:
Small organic molecule
Emp. Form.:
C12H10N4S
Mol. Mass.:
242.3
SMILES:
Nc1ccc(cc1)-c1csc2ncnc(N)c12
:
Substrate
Name:
Biotinylated PLKtide
Synonyms:
Type:
Peptide
Mol. Mass.:
1447.52
Organism:
Description:
Residue:
13
EVIEASFAEQEAK