Target
Dimer of Gag-Pol polyprotein [501-599]
Ligand
BDBM608734
Substrate
Fluorescent peptide substrate
Meas. Tech.
Protease Inhibition Assay
pH
5.5±n/a
Temperature
310.15±n/a K
Ki
0.24±n/a nM
Citation
 Lam, PYRu, YJadhav, PKAldrich, PEDeLucca, GVEyermann, CJChang, CHEmmett, GHoller, ERDaneker, WFLi, LConfalone, PNMcHugh, RJHan, QLi, RMarkwalder, JASeitz, SPSharpe, TRBacheler, LTRayner, MMKlabe, RMShum, LWinslow, DLKornhauser, DMHodge, CN Cyclic HIV protease inhibitors: synthesis, conformational analysis, P2/P2' structure-activity relationship, and molecular recognition of cyclic ureas. J Med Chem 39:3514-25 (1996)  
Target
Name:
Dimer of Gag-Pol polyprotein [501-599]
Synonyms:
HIV-1 Protease | HIV-1 Protease, recombinant, isolate HXB2
Type:
Protein Complex
Mol. Mass.:
Description:
Components:
This complex has 2 components.
Component 1
Name:
Gag-Pol polyprotein [501-599]
Synonyms:
BRU isolated HIV-1 Protease B Subtype Chain B LAI(Wild type) Protease Retropepsin | gag-pol
Type:
Enzyme Subunit
Mol. Mass.:
10795.19
Organism:
Human immunodeficiency virus type 1
Description:
P03367[501-599]
Residue:
99
  
Component 2
Name:
Gag-Pol polyprotein [501-599]
Synonyms:
BRU isolated HIV-1 Protease B Subtype Chain B LAI(Wild type) Protease Retropepsin | gag-pol
Type:
Enzyme Subunit
Mol. Mass.:
10795.19
Organism:
Human immunodeficiency virus type 1
Description:
P03367[501-599]
Residue:
99
  
Inhibitor
Name:
BDBM608734
Synonyms:
6-[(4R,5S,6S,7R)-4,7-dibenzyl-3-(5-carboxypentyl)-5,6-dihydroxy-2-oxo-1,3-diazepan-1-yl]hexanoic acid | DMPC Cyclic Urea 1
Type:
Emp. Form.:
C31H42N2O7
Mol. Mass.:
554.6744
SMILES:
O[C@@H]1[C@@H](O)[C@@H](Cc2ccccc2)N(CCCCCC(O)=O)C(=O)N(CCCCCC(O)=O)[C@@H]1Cc1ccccc1
:
Substrate
Name:
Fluorescent peptide substrate
Synonyms:
Type:
Peptide
Mol. Mass.:
4608.75
Organism:
Description:
Residue:
42