Target
Dimer of Gag-Pol polyprotein [501-599]
Ligand
BDBM178
Substrate
Fluorescent peptide substrate
Meas. Tech.
Protease Inhibition Assay
pH
5.5±n/a
Temperature
310.15±n/a K
Ki
0.018±n/a nM
Citation
 Lam, PYRu, YJadhav, PKAldrich, PEDeLucca, GVEyermann, CJChang, CHEmmett, GHoller, ERDaneker, WFLi, LConfalone, PNMcHugh, RJHan, QLi, RMarkwalder, JASeitz, SPSharpe, TRBacheler, LTRayner, MMKlabe, RMShum, LWinslow, DLKornhauser, DMHodge, CN Cyclic HIV protease inhibitors: synthesis, conformational analysis, P2/P2' structure-activity relationship, and molecular recognition of cyclic ureas. J Med Chem 39:3514-25 (1996)  
Target
Name:
Dimer of Gag-Pol polyprotein [501-599]
Synonyms:
HIV-1 Protease | HIV-1 Protease, recombinant, isolate HXB2
Type:
Protein Complex
Mol. Mass.:
Description:
Components:
This complex has 2 components.
Component 1
Name:
Gag-Pol polyprotein [501-599]
Synonyms:
BRU isolated HIV-1 Protease B Subtype Chain B LAI(Wild type) Protease Retropepsin | gag-pol
Type:
Enzyme Subunit
Mol. Mass.:
10795.19
Organism:
Human immunodeficiency virus type 1
Description:
P03367[501-599]
Residue:
99
  
Component 2
Name:
Gag-Pol polyprotein [501-599]
Synonyms:
BRU isolated HIV-1 Protease B Subtype Chain B LAI(Wild type) Protease Retropepsin | gag-pol
Type:
Enzyme Subunit
Mol. Mass.:
10795.19
Organism:
Human immunodeficiency virus type 1
Description:
P03367[501-599]
Residue:
99
  
Inhibitor
Name:
BDBM178
Synonyms:
(4R,5S,6S,7R)-4,7-dibenzyl-5,6-dihydroxy-1,3-bis({3-[1-(hydroxyimino)ethyl]phenyl}methyl)-1,3-diazepan-2-one CHEMBL431174 | Cyclic Urea
Type:
Emp. Form.:
C37H40N4O5
Mol. Mass.:
620.7373
SMILES:
CC(N=O)c1cccc(CN2[C@H](Cc3ccccc3)[C@H](O)[C@@H](O)[C@@H](Cc3ccccc3)N(Cc3cccc(c3)C(C)N=O)C2=O)c1
:
Substrate
Name:
Fluorescent peptide substrate
Synonyms:
Type:
Peptide
Mol. Mass.:
4608.75
Organism:
Description:
Residue:
42