Target
Beta-secretase 1
Ligand
BDBM25363
Substrate
BACE Substrate Peptide
Meas. Tech.
In Vitro BACE1 Activity Assay
pH
4.5±n/a
Temperature
295.15±n/a K
IC50
110±40 nM
Citation
 Barrow, JCStauffer, SRRittle, KENgo, PLYang, ZSelnick, HGGraham, SLMunshi, SMcGaughey, GBHolloway, MKSimon, AJPrice, EASankaranarayanan, SColussi, DTugusheva, KLai, MTEspeseth, ASXu, MHuang, QWolfe, APietrak, BZuck, PLevorse, DAHazuda, DVacca, JP Discovery and X-ray crystallographic analysis of a spiropiperidine iminohydantoin inhibitor of beta-secretase. J Med Chem 51:6259-62 (2008)  
Target
Name:
Beta-secretase 1
Synonyms:
ASP2 Aspartyl protease 2 BACE1 Beta-secretase (BACE) Beta-secretase 1 (BACE 1) Beta-secretase 1 (BACE1) Beta-site amyloid precursor protein cleaving enzyme 1 Memapsin-2 beta-Secretase (BACE-1) | beta-Secretase (BACE1)
Type:
Protein
Mol. Mass.:
55755.10
Organism:
Homo sapiens (Human)
Description:
P56817
Residue:
501
  
Inhibitor
Name:
BDBM25363
Synonyms:
4-(cyclohexylamino)-1-(3-fluorophenyl)-8-{[3-(2-methylphenyl)phenyl]methyl}-1,3,8-triazaspiro[4.5]dec-3-en-2-one | Spiropiperidine Iminohydantoin, 18
Type:
Small organic molecule
Emp. Form.:
C33H37FN4O
Mol. Mass.:
524.6715
SMILES:
Cc1ccccc1-c1cccc(CN2CCC3(CC2)N(C(O)=NC3=NC2CCCCC2)c2cccc(F)c2)c1
:
Substrate
Name:
BACE Substrate Peptide
Synonyms:
BACE-1 Substrate Peptide
Type:
Peptide
Mol. Mass.:
1557.77
Organism:
Description:
It is a coumarin (CM)-labeled peptide containing an optimized cleavage sequence NFEV.
Residue:
12
CMREVNFEVEFR