Target
Adenosine 5'-phosphosulfate reductase
Ligand
BDBM25464
Substrate
BDBM25461
Meas. Tech.
Determination of Dissociation Constant (Kd)
pH
7.5±n/a
Temperature
303.15±n/a K
Kd
15190±n/a nM
Citation
 Cosconati, SHong, JANovellino, ECarroll, KSGoodsell, DSOlson, AJ Structure-based virtual screening and biological evaluation of Mycobacterium tuberculosis adenosine 5'-phosphosulfate reductase inhibitors. J Med Chem 51:6627-30 (2008)  
Target
Name:
Adenosine 5'-phosphosulfate reductase
Synonyms:
3-phosphoadenylylsulfate reductase CYSH_MYCTO PAPS sulfotransferase cysH | phosphoadenosine phosphosulfate reductase
Type:
Oxidoreductase
Mol. Mass.:
27417.08
Organism:
Mycobacterium tuberculosis
Description:
Proteins were expressed by transforming a reductase-containing plasmid into E. coli cells.
Residue:
254
  
Inhibitor
Name:
BDBM25464
Synonyms:
6-[(7-nitro-2,1,3-benzoxadiazol-4-yl)sulfanyl]-9H-purin-2-amine | NSC348401
Type:
Small organic molecule
Emp. Form.:
C11H6N8O3S
Mol. Mass.:
330.282
SMILES:
Nc1nc(Sc2ccc([N+]([O-])=O)c3nonc23)c2[nH]cnc2n1
:
Substrate
Name:
BDBM25461
Synonyms:
Adenosine 5-Phosphosulfate Adenylyl sulfate | [({[(2R,3S,4R,5R)-5-(6-amino-9H-purin-9-yl)-3,4-dihydroxyoxolan-2-yl]methoxy}(hydroxy)phosphoryl)oxy]sulfonic acid
Type:
Nucleoside or nucleotide
Emp. Form.:
C10H14N5O10PS
Mol. Mass.:
427.284
SMILES:
Nc1ncnc2n(cnc12)[C@@H]1O[C@H](COP(O)(=O)OS(O)(=O)=O)[C@@H](O)[C@H]1O
: