Target
Carbonic anhydrase 2
Ligand
BDBM25896
Substrate
BDBM10856
Meas. Tech.
CA Inhibition Assay
pH
7.4±n/a
Temperature
298.15±n/a K
Ki
14±n/a nM
Citation
 Temperini, CInnocenti, AScozzafava, ASupuran, CT Carbonic anhydrase inhibitors. Interaction of the antitumor sulfamate EMD 486019 with twelve mammalian carbonic anhydrase isoforms: Kinetic and X-ray crystallographic studies. Bioorg Med Chem Lett 18:4282-6 (2008)  
Target
Name:
Carbonic anhydrase 2
Synonyms:
CA-II CAC Carbonate dehydratase II Carbonic anhydrase 2 (CA-II) Carbonic anhydrase C Carbonic anhydrase II (CA-II) Carbonic anhydrase II (hCA II) | Carbonic anhydrase isoenzyme II (hCA II)
Type:
Enzyme
Mol. Mass.:
29250.71
Organism:
Homo sapiens (Human)
Description:
P00918
Residue:
260
  
Inhibitor
Name:
BDBM25896
Synonyms:
EMD 486019 | [2-(cycloheptylmethyl)-1,1-dioxo--benzothiophen-6-yl] sulfamate
Type:
Small organic molecule
Emp. Form.:
C16H21NO5S2
Mol. Mass.:
371.472
SMILES:
NS(=O)(=O)Oc1ccc2C=C(CC3CCCCCC3)S(=O)(=O)c2c1
:
Substrate
Name:
BDBM10856
Synonyms:
Carbon Dioxide | methanedione
Type:
Small organic molecule
Emp. Form.:
CO2
Mol. Mass.:
44.0095
SMILES:
O=C=O
: