Target
Carbonic anhydrase 4
Ligand
BDBM25896
Substrate
BDBM10856
Meas. Tech.
CA Inhibition Assay
pH
7.4±n/a
Temperature
298.15±n/a K
Ki
842±n/a nM
Citation
 Temperini, CInnocenti, AScozzafava, ASupuran, CT Carbonic anhydrase inhibitors. Interaction of the antitumor sulfamate EMD 486019 with twelve mammalian carbonic anhydrase isoforms: Kinetic and X-ray crystallographic studies. Bioorg Med Chem Lett 18:4282-6 (2008)  
Target
Name:
Carbonic anhydrase 4
Synonyms:
CA-IV CAH4_HUMAN Carbonic anhydrase Carbonic anhydrase IV (CA IV)
Type:
Enzyme
Mol. Mass.:
35037.98
Organism:
Homo sapiens (Human)
Description:
P22748
Residue:
312
  
Inhibitor
Name:
BDBM25896
Synonyms:
EMD 486019 | [2-(cycloheptylmethyl)-1,1-dioxo--benzothiophen-6-yl] sulfamate
Type:
Small organic molecule
Emp. Form.:
C16H21NO5S2
Mol. Mass.:
371.472
SMILES:
NS(=O)(=O)Oc1ccc2C=C(CC3CCCCCC3)S(=O)(=O)c2c1
:
Substrate
Name:
BDBM10856
Synonyms:
Carbon Dioxide | methanedione
Type:
Small organic molecule
Emp. Form.:
CO2
Mol. Mass.:
44.0095
SMILES:
O=C=O
: