Target
Carbonic anhydrase 6
Ligand
BDBM13058
Substrate
BDBM10856
Meas. Tech.
CA Inhibition Assay
Ki
653±n/a nM
Citation
 Temperini, CInnocenti, AScozzafava, ASupuran, CT Carbonic anhydrase inhibitors. Interaction of the antitumor sulfamate EMD 486019 with twelve mammalian carbonic anhydrase isoforms: Kinetic and X-ray crystallographic studies. Bioorg Med Chem Lett 18:4282-6 (2008)  
Target
Name:
Carbonic anhydrase 6
Synonyms:
CA-VI CAH6_HUMAN Carbonic Anhydrase VI Carbonic anhydrase 6 Carbonic anhydrase 6 (CA-VI) Salivary carbonic anhydrase | Secreted carbonic anhydrase
Type:
Enzyme
Mol. Mass.:
35371.40
Organism:
Homo sapiens (Human)
Description:
P23280
Residue:
308
  
Inhibitor
Name:
BDBM13058
Synonyms:
6-oxo-6,7,8,9,10,11-hexahydrocyclohepta[c]chromen-3-yl sulfamate 667COUMATE CHEMBL286738 STX64 | {9-oxo-8-oxatricyclo[8.5.0.0^{2,7}]pentadeca-1(10),2(7),3,5-tetraen-5-yl} sulfamate
Type:
Small organic molecule
Emp. Form.:
C14H15NO5S
Mol. Mass.:
309.338
SMILES:
NS(=O)(=O)Oc1ccc2c3CCCCCc3c(=O)oc2c1
:
Substrate
Name:
BDBM10856
Synonyms:
Carbon Dioxide | methanedione
Type:
Small organic molecule
Emp. Form.:
CO2
Mol. Mass.:
44.0095
SMILES:
O=C=O
: