Target
Dipeptidyl peptidase 1
Ligand
BDBM385074
Substrate
Meas. Tech.
Fluorescence Assay A1 for Recombinant Human (RH) DPP1
IC50
60.3±n/a nM
Citation
 Lonn, HRConnolly, SSwallow, SKarlsson, SPAurell, CPontén, JFDoyle, KJVan De Poël, AJJones, GPWatson, DWMacritchie, JAPalmer, NJ Certain (2S)-N-[(1S)-1-cyano-2-phenylethyl]-1,4-oxazepane-2-carboxamides as dipeptidyl peptidase 1 inhibitors US Patent  US10287258 Publication Date 5/14/2019 
Target
Name:
Dipeptidyl peptidase 1
Synonyms:
CATC_HUMAN CTSC Cathepsin J Dipeptidyl peptidase 1 (DPPI) Dipeptidyl peptidase I (DPPI)
Type:
Enzyme
Mol. Mass.:
51857.28
Organism:
Homo sapiens (Human)
Description:
P53634
Residue:
463
  
Inhibitor
Name:
BDBM385074
Synonyms:
US10287258, Example 34 US11117874, Example 34 US11680049, Example 34
Type:
Small organic molecule
Emp. Form.:
C22H22N4O2
Mol. Mass.:
374.4357
SMILES:
O=C(N[C@@H](Cc1ccc(cc1)-c1ccc(cc1)C#N)C#N)C1CNCCCO1
: