Target
Aldo-keto reductase family 1 member C3
Ligand
BDBM26269
Substrate
BDBM26271
Meas. Tech.
Assay of Enzyme Activity
pH
7.4±n/a
Temperature
298.15±n/a K
Ki
94000±1300 nM
Citation
 Dhagat, UEndo, SSumii, RHara, AEl-Kabbani, O Selectivity determinants of inhibitor binding to human 20alpha-hydroxysteroid dehydrogenase: crystal structure of the enzyme in ternary complex with coenzyme and the potent inhibitor 3,5-dichlorosalicylic acid. J Med Chem 51:4844-8 (2008)  
Target
Name:
Aldo-keto reductase family 1 member C3
Synonyms:
17-beta-Hydroxysteroid Dehydrogenase 5 (17-beta-HSD5, AKR1C3) AK1C3_HUMAN Aldo-keto reductase family 1 member C3 Aldo-keto reductase family 1 member C3 (AK1C3a) Aldo-keto-reductase family 1 member C3 Dihydrodiol dehydrogenase 3 Estradiol 17-beta-dehydrogenase KIAA0119 Prostaglandin F synthase Trans-1,2-dihydrobenzene-1,2-diol dehydrogenase
Type:
Enzyme
Mol. Mass.:
36859.86
Organism:
Homo sapiens (Human)
Description:
P42330
Residue:
323
  
Inhibitor
Name:
BDBM26269
Synonyms:
3,5-dichloro-2-hydroxybenzoic acid CHEMBL449129
Type:
Small organic molecule
Emp. Form.:
C7H4Cl2O3
Mol. Mass.:
207.011
SMILES:
OC(=O)c1cc(Cl)cc(Cl)c1O
:
Substrate
Name:
BDBM26271
Synonyms:
(1S)-1,2,3,4-tetrahydronaphthalen-1-ol S-(+)-1,2,3,4-tetrahydro-1-naphthol | S-tetralol
Type:
Small organic molecule
Emp. Form.:
C10H12O
Mol. Mass.:
148.2017
SMILES:
O[C@H]1CCCc2ccccc12
: