Target
Angiopoietin-1 receptor
Ligand
BDBM14949
Substrate
Her2 Peptide Substrate
Meas. Tech.
HTRF Kinase Inhibition Assay
IC50
2±n/a nM
Citation
 DiMauro, EFNewcomb, JNunes, JJBemis, JEBoucher, CChai, LChaffee, SCDeak, HLEpstein, LFFaust, TGallant, PGore, AGu, YHenkle, BHsieh, FHuang, XKim, JLLee, JHMartin, MWMcGowan, DCMetz, DMohn, DMorgenstern, KAOliveira-dos-Santos, APatel, VFPowers, DRose, PESchneider, STomlinson, SATudor, YYTurci, SMWelcher, AAZhao, HZhu, LZhu, X Structure-guided design of aminopyrimidine amides as potent, selective inhibitors of lymphocyte specific kinase: synthesis, structure-activity relationships, and inhibition of in vivo T cell activation. J Med Chem 51:1681-94 (2008)  
Target
Name:
Angiopoietin-1 receptor
Synonyms:
TEK TIE2_HUMAN Tyrosine-protein kinase receptor (TIE-2) Tyrosine-protein kinase receptor TEK (p140 TEK) Tyrosine-protein kinase receptor TIE2/TEK VMCM1 p140 TEK
Type:
Enzyme
Mol. Mass.:
125835.70
Organism:
Homo sapiens (Human)
Description:
Q02763
Residue:
1124
  
Inhibitor
Name:
BDBM14949
Synonyms:
2-aminoquinazoline 5 CHEMBL385937 | JMC511681 Compound 34
Type:
Small organic molecule
Emp. Form.:
C23H17F3N4O
Mol. Mass.:
422.4025
SMILES:
Cc1ccc(cc1-c1ccc2nc(N)ncc2c1)C(=O)Nc1cccc(c1)C(F)(F)F
:
Substrate
Name:
Her2 Peptide Substrate
Synonyms:
Biotinylated Her2 Peptide Substrate | biotinylated long chain peptide
Type:
Peptide
Mol. Mass.:
2278.65
Organism:
Description:
Residue:
20