Target
Coagulation factor X
Ligand
BDBM387078
Substrate
Meas. Tech.
In Vitro Assay
Ki
<10±n/a nM
Citation
 Ding, ZLai, GChen, SYan, X Hydrazine compound as blood coagulation factor Xa inhibitor US Patent  US9938272 Publication Date 4/10/2018 
Target
Name:
Coagulation factor X
Synonyms:
Coagulation factor X precursor FA10_RAT Stuart factor
Type:
Enzyme
Mol. Mass.:
54255.03
Organism:
Rattus norvegicus (rat)
Description:
Residue:
482
  
Inhibitor
Name:
BDBM387078
Synonyms:
4-(4-(1-(6-Chloronaphthalen-2-yl)-7-oxo-3-(trifluoromethyl)-4,5-dihydro-1H-pyrazolo[3,4-c]pyridin-6(7H)-yl)piperidin-1-yl)morpholin-3-one | US9938272, Example 24
Type:
Small organic molecule
Emp. Form.:
C26H25ClF3N5O3
Mol. Mass.:
547.957
SMILES:
FC(F)(F)c1nn(c2c1CCN(C1CCN(CC1)N1CCOCC1=O)C2=O)-c1ccc2cc(Cl)ccc2c1
: