Target
Collagenase 3
Ligand
BDBM26554
Substrate
BDBM23499
Meas. Tech.
MMP Inhibition Assay
pH
7.4±n/a
Temperature
295.15±n/a K
Ki
1700±n/a nM
Citation
 Bandarage, UKWang, TCome, JHPerola, EWei, YRao, BG Novel thiol-based TACE inhibitors. Part 2: Rational design, synthesis, and SAR of thiol-containing aryl sulfones. Bioorg Med Chem Lett 18:44-8 (2008)  
Target
Name:
Collagenase 3
Synonyms:
MMP-13 MMP13_HUMAN Matrix metalloproteinase-13 (MMP-13) | Matrix metalloproteinase-13 (MMP13)
Type:
Enzyme
Mol. Mass.:
53808.06
Organism:
Homo sapiens (Human)
Description:
P45452
Residue:
471
  
Inhibitor
Name:
BDBM26554
Synonyms:
3-{[4-(but-2-yn-1-yloxy)benzene]sulfonyl}propane-1-thiol thiol-aryl sulfone, 8b
Type:
Small organic molecule
Emp. Form.:
C13H16O3S2
Mol. Mass.:
284.394
SMILES:
CC#CCOc1ccc(cc1)S(=O)(=O)CCCS
:
Substrate
Name:
BDBM23499
Synonyms:
7-methoxycoumarin-PQGL-(3-[2,4-dinitrophenyl]-L-2,3-diaminopropionyl)-AR-OH | Wammp-5
Type:
Fluorogenic substrate
Emp. Form.:
Mol. Mass.:
SMILES:
: