Target
Kallikrein-1
Ligand
BDBM263304
Substrate
Kallikrein 1
Meas. Tech.
Enzymatic Activity Assay
IC50
4710±n/a nM
Citation
 Davie, RLEdwards, HJEvans, DMHodgson, STMiller, INovak, ARSmith, AJStocks, MJ Heterocyclic derivates US Patent  US9533987 Publication Date 1/3/2017 
Target
Name:
Kallikrein-1
Synonyms:
KLK1 Kallikrein 1 Kidney/pancreas/salivary gland kallikrein | Tissue kallikrein
Type:
Enzyme
Mol. Mass.:
28874.69
Organism:
Homo sapiens (Human)
Description:
P06870
Residue:
262
  
Inhibitor
Name:
BDBM263304
Synonyms:
1-[2-(4-methyl-pyrazol-1-ylmethyl)-thiazol-4-ylmethyl]-3-trifluoromethyl-1h-pyrazole-4-carboxylic acid (1-amino-isoquinolin-6-ylmethyl)-amide | US9533987, example 82
Type:
Small organic molecule
Emp. Form.:
C24H21F3N8OS
Mol. Mass.:
526.537
SMILES:
Cc1cnn(Cc2nc(Cn3cc(C(=O)NCc4ccc5c(N)nccc5c4)c(n3)C(F)(F)F)cs2)c1
:
Substrate
Name:
Kallikrein-1
Synonyms:
KLK1 Kallikrein 1 Kidney/pancreas/salivary gland kallikrein | Tissue kallikrein
Type:
Enzyme
Mol. Mass.:
28874.69
Organism:
Homo sapiens (Human)
Description:
P06870
Residue:
262