Target
Mediator of DNA damage checkpoint protein 1
Ligand
BDBM65454
Substrate
Meas. Tech.
cytomteric bead array (CBA) assay
Temperature
310.15±n/a K
IC50
190±n/a nM
Comments
extracted
Citation
 Gandhi, ADimartino, JChopra, R Methods for the treatment of locally advanced breast cancer US Patent  US9694015 Publication Date 7/4/2017 
Target
Name:
Mediator of DNA damage checkpoint protein 1
Synonyms:
KIAA0170 MDC1_HUMAN Nuclear factor with BRCT domains 1
Type:
Protein
Mol. Mass.:
226625.15
Organism:
Homo sapiens (Human)
Description:
Q14676
Residue:
2089
  
Inhibitor
Name:
BDBM65454
Synonyms:
191732-72-6 Lenalidomide Revlimid US9694015, 6.1
Type:
Small organic molecule
Emp. Form.:
C13H13N3O3
Mol. Mass.:
259.2606
SMILES:
Nc1cccc2C(=O)N(Cc12)C1CCC(=O)NC1=O
: