Target
D(2) dopamine receptor
Ligand
BDBM50207091
Substrate
Meas. Tech.
Receptor Binding Test
pH
7.5±n/a
Ki
1.45±n/a nM
Comments
extracted
Citation
 Li, JChen, XMa, ZZhang, LCui, N Benzoisothiazole compounds and methods of treating schizophrenia US Patent  US9550741 Publication Date 1/24/2017 
Target
Name:
D(2) dopamine receptor
Synonyms:
D(2) dopamine receptor DOPAMINE D2 Long DRD2 Dopamine D2 receptor Dopamine D2 receptor (D2R) Dopamine2-like | d2
Type:
Cell-surface receptors
Mol. Mass.:
50647.10
Organism:
Homo sapiens (Human)
Description:
P14416
Residue:
443
  
Inhibitor
Name:
BDBM50207091
Synonyms:
CHEMBL3953773 | US9550741, IV-6
Type:
Small organic molecule
Emp. Form.:
C27H35N5OS
Mol. Mass.:
477.665
SMILES:
CN(C(=O)N[C@H]1CC[C@H](CCN2CCN(CC2)c2nsc3ccccc23)CC1)c1ccccc1
: