Target
5-hydroxytryptamine receptor 1A
Ligand
BDBM50207091
Substrate
Meas. Tech.
5-HT1A Receptor Binding Test
pH
7.4±n/a
Ki
4.60±n/a nM
Comments
extracted
Citation
 Li, JChen, XMa, ZZhang, LCui, N Benzoisothiazole compounds and methods of treating schizophrenia US Patent  US9550741 Publication Date 1/24/2017 
Target
Name:
5-hydroxytryptamine receptor 1A
Synonyms:
5-HT-1A 5-hydroxytryptamine receptor 1A (5-HT-1A) ADRB2RL1 Dopamine D2 receptor and serotonin 1a receptor HTR1A | Serotonin receptor 1A
Type:
Mol. Mass.:
46122.49
Organism:
Homo sapiens (Human)
Description:
Residue:
422
  
Inhibitor
Name:
BDBM50207091
Synonyms:
CHEMBL3953773 | US9550741, IV-6
Type:
Small organic molecule
Emp. Form.:
C27H35N5OS
Mol. Mass.:
477.665
SMILES:
CN(C(=O)N[C@H]1CC[C@H](CCN2CCN(CC2)c2nsc3ccccc23)CC1)c1ccccc1
: