Target
Carbonic anhydrase 15 [19-324]
Ligand
BDBM10874
Substrate
BDBM10856
Meas. Tech.
CA Inhibition Assay
pH
7.5±n/a
Temperature
293.15±n/a K
Ki
64±n/a nM
Citation
 Hilvo, MSalzano, AMInnocenti, AKulomaa, MSScozzafava, AScaloni, AParkkila, SSupuran, CT Cloning, expression, post-translational modifications and inhibition studies on the latest mammalian carbonic anhydrase isoform, CA XV. J Med Chem 52:646-54 (2009)  
Target
Name:
Carbonic anhydrase 15 [19-324]
Synonyms:
CA-XV Ca15 Carbonate dehydratase XV | Carbonic Anhydrase XV
Type:
Enzyme
Mol. Mass.:
33409.51
Organism:
Mus musculus (mouse)
Description:
Mouse cloned isozyme.
Residue:
306
  
Inhibitor
Name:
BDBM10874
Synonyms:
6-hydroxy-1,3-benzothiazole-2-sulfonamide aromatic/heteroaromatic sulfonamide 19
Type:
Small organic molecule
Emp. Form.:
C7H6N2O3S2
Mol. Mass.:
230.264
SMILES:
NS(=O)(=O)c1nc2ccc(O)cc2s1
:
Substrate
Name:
BDBM10856
Synonyms:
Carbon Dioxide | methanedione
Type:
Small organic molecule
Emp. Form.:
CO2
Mol. Mass.:
44.0095
SMILES:
O=C=O
: