Target
Carbonic anhydrase 15 [19-324]
Ligand
BDBM10890
Substrate
BDBM10856
Meas. Tech.
CA Inhibition Assay
Ki
72±n/a nM
Citation
 Hilvo, MSalzano, AMInnocenti, AKulomaa, MSScozzafava, AScaloni, AParkkila, SSupuran, CT Cloning, expression, post-translational modifications and inhibition studies on the latest mammalian carbonic anhydrase isoform, CA XV. J Med Chem 52:646-54 (2009)  
Target
Name:
Carbonic anhydrase 15 [19-324]
Synonyms:
CA-XV Ca15 Carbonate dehydratase XV | Carbonic Anhydrase XV
Type:
Enzyme
Mol. Mass.:
33409.51
Organism:
Mus musculus (mouse)
Description:
Mouse cloned isozyme.
Residue:
306
  
Inhibitor
Name:
BDBM10890
Synonyms:
1-N-(3-chloro-1H-indol-7-yl)benzene-1,4-disulfonamide Compound 6 Indisulam (IND) | Sulfonamide, 7
Type:
Small organic molecule
Emp. Form.:
C14H12ClN3O4S2
Mol. Mass.:
385.846
SMILES:
NS(=O)(=O)c1ccc(cc1)S(=O)(=O)Nc1cccc2c(Cl)c[nH]c12
:
Substrate
Name:
BDBM10856
Synonyms:
Carbon Dioxide | methanedione
Type:
Small organic molecule
Emp. Form.:
CO2
Mol. Mass.:
44.0095
SMILES:
O=C=O
: