Target
Aurora kinase B
Ligand
BDBM27086
Substrate
Biotinylated Cross-tide Substrate
Meas. Tech.
Aurora Kinase Assay
pH
8.5±n/a
Temperature
295.15±n/a K
IC50
10±n/a nM
Citation
 Howard, SBerdini, VBoulstridge, JACarr, MGCross, DMCurry, JDevine, LAEarly, TRFazal, LGill, ALHeathcote, MMaman, SMatthews, JEMcMenamin, RLNavarro, EFO'Brien, MAO'Reilly, MRees, DCReule, MTisi, DWilliams, GVinković, MWyatt, PG Fragment-based discovery of the pyrazol-4-yl urea (AT9283), a multitargeted kinase inhibitor with potent aurora kinase activity. J Med Chem 52:379-88 (2009)  
Target
Name:
Aurora kinase B
Synonyms:
AIK2 AIM1 ARK2 AURKB_HUMAN Aurora B-INCENP Aurora kinase B (AURKB) STK-1 STK12 Serine/threonine-protein kinase aurora B
Type:
Protein
Mol. Mass.:
39327.72
Organism:
Homo sapiens (Human)
Description:
Q96GD4
Residue:
344
  
Inhibitor
Name:
BDBM27086
Synonyms:
3-{3-[5-(morpholin-4-ylmethyl)-1H-1,3-benzodiazol-2-yl]-1H-pyrazol-4-yl}-1-oxan-4-ylurea | pyrazole-benzimidazole urea analogue, 15
Type:
Small organic molecule
Emp. Form.:
C21H27N7O3
Mol. Mass.:
425.4842
SMILES:
O=C(NC1CCOCC1)Nc1c[nH]nc1-c1nc2ccc(CN3CCOCC3)cc2[nH]1
:
Substrate
Name:
Biotinylated Cross-tide Substrate
Synonyms:
Type:
Peptide
Mol. Mass.:
2578.93
Organism:
Description:
Residue:
24