Target
Poly [ADP-ribose] polymerase 1
Ligand
BDBM27090
Substrate
BDBM27089
Meas. Tech.
In Vitro PARP Enzyme Assay
pH
8±n/a
Temperature
295.15±n/a K
Ki
44±n/a nM
Citation
 Penning, TDZhu, GDGandhi, VBGong, JThomas, SLubisch, WGrandel, RWernet, WPark, CHFry, EHLiu, XShi, YKlinghofer, VJohnson, EFDonawho, CKFrost, DJBontcheva-Diaz, VBouska, JJOlson, AMMarsh, KCLuo, YRosenberg, SHGiranda, VL Discovery and SAR of 2-(1-propylpiperidin-4-yl)-1H-benzimidazole-4-carboxamide: A potent inhibitor of poly(ADP-ribose) polymerase (PARP) for the treatment of cancer. Bioorg Med Chem 16:6965-75 (2008)  
Target
Name:
Poly [ADP-ribose] polymerase 1
Synonyms:
(ARTD1 or PARP1) 2.4.2.30 ADPRT ARTD1 Human diphtheria toxin-like ADP-ribosyltransferase (ARTD1 or PARP1) NT-PARP-1 PARP1 PPOL Poly [ADP-ribose] polymerase 1 (PARP) Poly [ADP-ribose] polymerase 1 (PARP1) Poly [ADP-ribose] polymerase 1, 28-kDa form Poly [ADP-ribose] polymerase 1, processed C-terminus Poly [ADP-ribose] polymerase-1 Poly(ADP-ribose) polymerase-1 (ARTD1/PARP1) Protein poly-ADP-ribosyltransferase PARP1 | Synonyms=ADPRT
Type:
Mol. Mass.:
113114.22
Organism:
Homo sapiens (Human)
Description:
P09874
Residue:
1014
  
Inhibitor
Name:
BDBM27090
Synonyms:
2-(4-methoxycyclohexyl)-1H-1,3-benzodiazole-4-carboxamide | cycloalkyl-containing benzimidazole carboxamide, 2a
Type:
Small organic molecule
Emp. Form.:
C15H19N3O2
Mol. Mass.:
273.3303
SMILES:
COC1CCC(CC1)c1nc2cccc(C(N)=O)c2[nH]1
:
Substrate
Name:
BDBM27089
Synonyms:
[3H] Nicotinamide adenine dinucleotide biotinylated NAD+
Type:
radiolabeled substrate
Emp. Form.:
C21H28N7O14P2
Mol. Mass.:
664.4325
SMILES:
NC(=O)c1ccc[n+](c1)[C@H]1O[C@@H](COP(O)(=O)OP(O)(=O)OC[C@H]2O[C@H]([C@H](O)[C@@H]2O)n2cnc3c(N)ncnc23)[C@H](O)[C@@H]1O
: