Target
RAC-gamma serine/threonine-protein kinase
Ligand
BDBM27228
Substrate
AKTide-2T
Meas. Tech.
Fluorometric TLC Kinase Assay
IC50
3750±n/a nM
Citation
 Lavogina, DLust, MViil, IKönig, NRaidaru, GRogozina, JEnkvist, EUri, ABossemeyer, D Structural analysis of ARC-type inhibitor (ARC-1034) binding to protein kinase A catalytic subunit and rational design of bisubstrate analogue inhibitors of basophilic protein kinases. J Med Chem 52:308-21 (2009)  
Target
Name:
RAC-gamma serine/threonine-protein kinase
Synonyms:
AKT3 PKB gamma Protein kinase Akt-3 Protein kinase B, gamma RAC-gamma serine/threonine-protein kinase Serine/threonine-protein kinase AKT | Serine/threonine-protein kinase AKT3
Type:
Enzyme
Mol. Mass.:
55769.36
Organism:
Homo sapiens (Human)
Description:
Residue:
479
  
Inhibitor
Name:
BDBM27228
Synonyms:
6-{[(2S,3S,4R,5R)-5-(6-amino-9H-purin-9-yl)-3,4-dihydroxyoxolan-2-yl]formamido}-N-[(1R)-1-[(5-{[(1R)-4-carbamimidamido-1-{[(1R)-4-carbamimidamido-1-carbamoylbutyl]carbamoyl}butyl]carbamoyl}pentyl)carbamoyl]ethyl]hexanamide | ARC-1039, 25
Type:
Small organic molecule
Emp. Form.:
C37H63N17O9
Mol. Mass.:
890.0046
SMILES:
[#6]-[#6@@H](-[#7]-[#6](=O)-[#6]-[#6]-[#6]-[#6]-[#6]-[#7]-[#6](=O)-[#6@H]-1-[#8]-[#6@H](-[#6@H](-[#8])-[#6@@H]-1-[#8])-n1cnc2c(-[#7])ncnc12)-[#6](=O)-[#7]-[#6]-[#6]-[#6]-[#6]-[#6]-[#6](=O)-[#7]-[#6@H](-[#6]-[#6]-[#6]\[#7]=[#6](/[#7])-[#7])-[#6](=O)-[#7]-[#6@H](-[#6]-[#6]-[#6]\[#7]=[#6](\[#7])-[#7])-[#6](-[#7])=O
:
Substrate
Name:
AKTide-2T
Synonyms:
AKT/PKB/Rac Protein Kinase Substrate
Type:
Peptide
Mol. Mass.:
1719.90
Organism:
Description:
Residue:
14
ARKRERTYSFGHHA