Target
Inhibitor of nuclear factor kappa-B kinase subunit epsilon
Ligand
BDBM27444
Substrate
I-kappa-B-alpha
Meas. Tech.
IKK Kinase Inhibition Assay
pH
7.4±n/a
Temperature
295.15±n/a K
IC50
>15849±n/a nM
Citation
 Bamborough, PChristopher, JACutler, GJDickson, MCMellor, GWMorey, JVPatel, CBShewchuk, LM 5-(1H-Benzimidazol-1-yl)-3-alkoxy-2-thiophenecarbonitriles as potent, selective, inhibitors of IKK-epsilon kinase. Bioorg Med Chem Lett 16:6236-40 (2006)  
Target
Name:
Inhibitor of nuclear factor kappa-B kinase subunit epsilon
Synonyms:
I kappa-B kinase epsilon I-kappa-B kinase epsilon (IKK-E) IKBKE IKK-epsilon IKKE IKKI KIAA0151 | von Hippel-Lindau disease tumor suppressor/Inhibitor of nuclear factor kappa-B kinase subunit epsilon
Type:
Serine/threonine-protein kinase
Mol. Mass.:
80475.98
Organism:
Homo sapiens (Human)
Description:
Kinase inhibitory activity was determined using recombinant human IKK-epsilon expressed in baculovirus as a FLAG-tagged fusion protein.
Residue:
716
  
Inhibitor
Name:
BDBM27444
Synonyms:
5-(5,6-dimethoxy-1H-1,3-benzodiazol-1-yl)-3-[(4-methanesulfonylphenyl)methoxy]thiophene-2-carboxamide benzimidazole-thiophene carboxamide, 2
Type:
Small organic molecule
Emp. Form.:
C22H21N3O6S2
Mol. Mass.:
487.549
SMILES:
COc1cc2ncn(-c3cc(OCc4ccc(cc4)S(C)(=O)=O)c(s3)C(N)=O)c2cc1OC
:
Substrate
Name:
NF-kappa-B inhibitor alpha
Synonyms:
I-kappa-B-alpha IKBA_HUMAN NF-kappa-B inhibitor alpha NFKBIA
Type:
GST fusion protein
Mol. Mass.:
35584.84
Organism:
Homo sapiens (Human)
Description:
It was produced in E. coli as GST-tagged fusion protein (Santa Cruz Biotechnology).
Residue:
317