Target
Glycogen phosphorylase, liver form
Ligand
BDBM27737
Substrate
BDBM24362
Meas. Tech.
Human Liver GPa Enzymatic Activity Assay
pH
7.6±n/a
Temperature
298.15±n/a K
IC50
143±23 nM
Citation
 Thomson, SABanker, PBickett, DMBoucheron, JACarter, HLClancy, DCCooper, JPDickerson, SHGarrido, DMNolte, RTPeat, AJSheckler, LRSparks, SMTavares, FXWang, LWang, TYWeiel, JE Anthranilimide based glycogen phosphorylase inhibitors for the treatment of type 2 diabetes. Part 3: X-ray crystallographic characterization, core and urea optimization and in vivo efficacy. Bioorg Med Chem Lett 19:1177-82 (2009)  
Target
Name:
Glycogen phosphorylase, liver form
Synonyms:
Glycogen Phosphorylase (PYGL) Liver glycogen phosphorylase PYGL_HUMAN
Type:
Homodimer
Mol. Mass.:
97153.98
Organism:
Homo sapiens (Human)
Description:
Dimers associate into a tetramer to form the enzymatically active phosphorylase A.
Residue:
847
  
Inhibitor
Name:
BDBM27737
Synonyms:
(2S)-2-cyclohexyl-2-[(4-fluoro-2-{[(2,4,6-trimethylphenyl)carbamoyl]amino}phenyl)formamido]acetic acid | anthranilimide based compound, 13
Type:
Small organic molecule
Emp. Form.:
C25H30FN3O4
Mol. Mass.:
455.5218
SMILES:
Cc1cc(C)c(NC(=O)Nc2cc(F)ccc2C(=O)N[C@@H](C2CCCCC2)C(O)=O)c(C)c1
:
Substrate
Name:
BDBM24362
Synonyms:
(glucose)n | glycogen
Type:
polymer of glucose
Emp. Form.:
Mol. Mass.:
SMILES:
: