Target
Macrophage colony-stimulating factor 1 receptor
Ligand
BDBM27890
Substrate
FMS Substrate Peptide
Meas. Tech.
FMS Enzyme Inhibition Assay
pH
7.5±n/a
Temperature
295.15±n/a K
IC50
0.8±n/a nM
Citation
 Huang, HHutta, DARinker, JMHu, HParsons, WHSchubert, CDesjarlais, RLCrysler, CSChaikin, MADonatelli, RRChen, YCheng, DZhou, ZYurkow, EManthey, CLPlayer, MR Pyrido[2,3-d]pyrimidin-5-ones: A Novel Class of Antiinflammatory Macrophage Colony-Stimulating Factor-1 Receptor Inhibitors (dagger). J Med Chem 52:1081-99 (2009)  
Target
Name:
Macrophage colony-stimulating factor 1 receptor
Synonyms:
CSF1R FMS Macrophage colony stimulating factor receptor Macrophage colony-stimulating factor 1 receptor (c-FMS) Proto-oncogene c-Fms c-fms | cFMS
Type:
Protein
Mol. Mass.:
107979.48
Organism:
Homo sapiens (Human)
Description:
P07333
Residue:
972
  
Inhibitor
Name:
BDBM27890
Synonyms:
8-(2,3-dihydro-1H-inden-5-yl)-2-({4-[2-(4-methylpiperazin-1-yl)ethyl]phenyl}amino)-5-oxo-5H,8H-pyrido[2,3-d]pyrimidine-6-carboxamide | Pyrido[2,3-d]pyrimidin-5-one, 17a
Type:
Small organic molecule
Emp. Form.:
C30H33N7O2
Mol. Mass.:
523.6287
SMILES:
CN1CCN(CCc2ccc(Nc3ncc4c(n3)n(cc(C(N)=O)c4=O)-c3ccc4CCCc4c3)cc2)CC1
:
Substrate
Name:
Macrophage colony-stimulating factor 1 receptor [555-568]
Synonyms:
CSF1R FMS FMS Substrate Peptide (aa 555-568) | Macrophage colony-stimulating factor 1 receptor (CSF1R) or (c-fms)
Type:
Peptide
Mol. Mass.:
1619.64
Organism:
Homo sapiens (Human)
Description:
P07333 aa 555-568
Residue:
14
SYEGNSYTFIDPTQ