Target
High affinity nerve growth factor receptor [440-796]
Ligand
BDBM27890
Substrate
polyGlu4Tyr
Meas. Tech.
TrkA Enzyme Inhibition Assay
Temperature
298.15±n/a K
IC50
170±n/a nM
Comments
extracted
Citation
 Huang, HHutta, DARinker, JMHu, HParsons, WHSchubert, CDesjarlais, RLCrysler, CSChaikin, MADonatelli, RRChen, YCheng, DZhou, ZYurkow, EManthey, CLPlayer, MR Pyrido[2,3-d]pyrimidin-5-ones: A Novel Class of Antiinflammatory Macrophage Colony-Stimulating Factor-1 Receptor Inhibitors (dagger). J Med Chem 52:1081-99 (2009)  
Target
Name:
High affinity nerve growth factor receptor [440-796]
Synonyms:
High affinity nerve growth factor receptor NTRK1 Neurotrophic tyrosine kinase receptor type 1 TRK1-transforming tyrosine kinase protein Tyrosine Kinase TrkA | p140-TrkA
Type:
Cytoplasmic region
Mol. Mass.:
40053.30
Organism:
Homo sapiens (Human)
Description:
The histidine-tagged recombinant human TrkA cytoplasmic domain (amino acids 440-796) expressed in insect cells was used in enzyme assays.
Residue:
357
  
Inhibitor
Name:
BDBM27890
Synonyms:
8-(2,3-dihydro-1H-inden-5-yl)-2-({4-[2-(4-methylpiperazin-1-yl)ethyl]phenyl}amino)-5-oxo-5H,8H-pyrido[2,3-d]pyrimidine-6-carboxamide | Pyrido[2,3-d]pyrimidin-5-one, 17a
Type:
Small organic molecule
Emp. Form.:
C30H33N7O2
Mol. Mass.:
523.6287
SMILES:
CN1CCN(CCc2ccc(Nc3ncc4c(n3)n(cc(C(N)=O)c4=O)-c3ccc4CCCc4c3)cc2)CC1
:
Substrate
Name:
polyGlu4Tyr
Synonyms:
Type:
Random copolymer
Mol. Mass.:
358.43
Organism:
Description:
Residue:
3
NA