Target
Serine/threonine-protein kinase B-raf [V600E]
Ligand
BDBM88056
Substrate
MEK1 (K97R)
Meas. Tech.
Raf Activity Assay
pH
7.5±n/a
Temperature
298.15±n/a K
IC50
51±n/a nM
Comments
extracted
Citation
 Aversa, RJBarsanti, PABurger, MDillon, MPDipesa, AHu, CLou, YNishiguchi, GPan, YPolyakov, VRamurthy, SRico, ASetti, LSmith, ASubramanian, STaft, BTanner, HWan, LYusuff, N Biaryl amide compounds as kinase inhibitors US Patent  US9694016 Publication Date 7/4/2017 
Target
Name:
Serine/threonine-protein kinase B-raf [V600E]
Synonyms:
B-RAF V600E B-Raf Protein Kinase Mutant (V600E) BRAF BRAF mutant V600E BRAF_HUMAN Protein mono-ADP-ribosyltransferase (PARP3) RAFB1 Serine/threonine-protein kinase B-raf (V600E) V-RAF murine sarcoma viral oncogene homologue B1 mutant (BRAF V600E)
Type:
Mol. Mass.:
84474.98
Organism:
Homo sapiens (Human)
Description:
P15056 V600E
Residue:
766
  
Inhibitor
Name:
BDBM88056
Synonyms:
US10245267, Example 1090 US9694016, 1090
Type:
Small organic molecule
Emp. Form.:
C25H28N6O5S
Mol. Mass.:
524.592
SMILES:
Cc1ncc(NC(=O)c2ccnc(c2)S(C)(=O)=O)cc1-c1cc(nc(c1)N1CCOCC1)N1CC(O)C1
:
Substrate
Name:
Dual specificity mitogen-activated protein kinase kinase 1 [K97R]
Synonyms:
Dual specificity mitogen-activated protein kinase kinase 1 (MEK1)(K97R) MEK1 MP2K1_HUMAN | PRKMK1
Type:
Mol. Mass.:
43467.04
Organism:
Homo sapiens (Human)
Description:
Biotinylated full length MEK1 with an inactivating K97R ATP binding site mutation.
Residue:
393