Target
Receptor activity-modifying protein 1
Ligand
BDBM391723
Substrate
Meas. Tech.
Radioligand Binding Assay
Ki
0.040±n/a nM
Citation
 Christopher, JACongreve, MSBucknell, SJDeflorian, FPickworth, MMason, JS CGRP receptor antagonists US Patent  US10300056 Publication Date 5/28/2019 
Target
Name:
Receptor activity-modifying protein 1
Synonyms:
Calcitonin-gene-related peptide receptor, CALCRL/RAMP1 RAMP1_HUMAN
Type:
PROTEIN
Mol. Mass.:
16992.80
Organism:
Homo sapiens (Human)
Description:
EBI_100673
Residue:
148
  
Inhibitor
Name:
BDBM391723
Synonyms:
3,5-dibromo-Nalpha-{[4-(2- US10888561, Example 8
Type:
Small organic molecule
Emp. Form.:
C38H46Br2N10O5
Mol. Mass.:
882.644
SMILES:
Oc1c(Br)cc(C[C@@H](NC(=O)N2CCC(CC2)n2c3cccnc3[nH]c2=O)C(=O)N[C@@H](CC2CCNCC2)C(=O)N2CCN(CC2)c2ccncc2)cc1Br
: