Target
Serine/threonine-protein kinase PLK1
Ligand
BDBM27443
Substrate
PLK Substrate Peptide
Meas. Tech.
Scintillation Proximity Assay (SPA)
pH
7.2±n/a
Temperature
295.15±n/a K
IC50
70±n/a nM
Citation
 Emmitte, KAAndrews, CWBadiang, JGDavis-Ward, RGDickson, HDDrewry, DHEmerson, HKEpperly, AHHassler, DFKnick, VBKuntz, KWLansing, TJLinn, JAMook, RANailor, KESalovich, JMSpehar, GMCheung, M Discovery of thiophene inhibitors of polo-like kinase. Bioorg Med Chem Lett 19:1018-21 (2009)  
Target
Name:
Serine/threonine-protein kinase PLK1
Synonyms:
PLK PLK1 Polo-like kinase 1 (PlK1) STPK13 Serine/threonine-protein kinase 13 | polo-like kinase
Type:
Serine/threonine-protein kinase
Mol. Mass.:
68277.16
Organism:
Homo sapiens (Human)
Description:
P53350
Residue:
603
  
Inhibitor
Name:
BDBM27443
Synonyms:
5-(1H-1,3-benzodiazol-1-yl)-3-[(4-methylphenyl)methoxy]thiophene-2-carboxamide benzimidazole-thiophene carboxamide, 1
Type:
Small organic molecule
Emp. Form.:
C20H17N3O2S
Mol. Mass.:
363.433
SMILES:
Cc1ccc(COc2cc(sc2C(N)=O)-n2cnc3ccccc23)cc1
:
Substrate
Name:
PLK Substrate Peptide
Synonyms:
Type:
Biotinylated peptide
Mol. Mass.:
1720.29
Organism:
Description:
Residue:
15
ITINAHSFNDTLDFD