Target
Serine/threonine-protein kinase PLK1
Ligand
BDBM27444
Substrate
PLK Substrate Peptide
Meas. Tech.
Scintillation Proximity Assay (SPA)
IC50
75±n/a nM
Citation
 Emmitte, KAAndrews, CWBadiang, JGDavis-Ward, RGDickson, HDDrewry, DHEmerson, HKEpperly, AHHassler, DFKnick, VBKuntz, KWLansing, TJLinn, JAMook, RANailor, KESalovich, JMSpehar, GMCheung, M Discovery of thiophene inhibitors of polo-like kinase. Bioorg Med Chem Lett 19:1018-21 (2009)  
Target
Name:
Serine/threonine-protein kinase PLK1
Synonyms:
PLK PLK1 Polo-like kinase 1 (PlK1) STPK13 Serine/threonine-protein kinase 13 | polo-like kinase
Type:
Serine/threonine-protein kinase
Mol. Mass.:
68277.16
Organism:
Homo sapiens (Human)
Description:
P53350
Residue:
603
  
Inhibitor
Name:
BDBM27444
Synonyms:
5-(5,6-dimethoxy-1H-1,3-benzodiazol-1-yl)-3-[(4-methanesulfonylphenyl)methoxy]thiophene-2-carboxamide benzimidazole-thiophene carboxamide, 2
Type:
Small organic molecule
Emp. Form.:
C22H21N3O6S2
Mol. Mass.:
487.549
SMILES:
COc1cc2ncn(-c3cc(OCc4ccc(cc4)S(C)(=O)=O)c(s3)C(N)=O)c2cc1OC
:
Substrate
Name:
PLK Substrate Peptide
Synonyms:
Type:
Biotinylated peptide
Mol. Mass.:
1720.29
Organism:
Description:
Residue:
15
ITINAHSFNDTLDFD