Target
5-hydroxytryptamine receptor 6
Ligand
BDBM28581
Substrate
BDBM21342
Meas. Tech.
Radioligand Binding Assay (Ki)
pH
7.4±n/a
Temperature
295.15±n/a K
Ki
18±n/a nM
Citation
 Liu, KGLo, JRComery, TAZhang, GMZhang, JYKowal, DMSmith, DLDi, LKerns, EHSchechter, LERobichaud, AJ 1-Sulfonylindazoles as potent and selective 5-HT6 ligands. Bioorg Med Chem Lett 19:2413-5 (2009)  
Target
Name:
5-hydroxytryptamine receptor 6
Synonyms:
5-HT-6 5-hydroxytryptamine receptor 6 (5-HT-6) 5-hydroxytryptamine receptor 6 (5HT6) HTR6 Serotonin 6 (5-HT6) receptor | Serotonin Receptor 6
Type:
G Protein-Coupled Receptor (GPCR)
Mol. Mass.:
46968.43
Organism:
Homo sapiens (Human)
Description:
P50406
Residue:
440
  
Inhibitor
Name:
BDBM28581
Synonyms:
1-(naphthalene-1-sulfonyl)-N-(piperidin-4-ylmethyl)-1H-indazol-6-amine | 1-sulfonylindazole, 8
Type:
Small organic molecule
Emp. Form.:
C23H24N4O2S
Mol. Mass.:
420.527
SMILES:
O=S(=O)(c1cccc2ccccc12)n1ncc2ccc(NCC3CCNCC3)cc12
:
Substrate
Name:
BDBM21342
Synonyms:
(4R,7R)-N,N-diethyl-6-methyl-6,11-diazatetracyclo[7.6.1.0^{2,7}.0^{12,16}]hexadeca-1(16),2,9,12,14-pentaene-4-carboxamide LSD LSD,(+) Lysergic Acid Diethylamide [3H]-LSD | d-Isolysergic acid amide
Type:
radiolabeled ligand
Emp. Form.:
C20H25N3O
Mol. Mass.:
323.432
SMILES:
[H][C@@]12Cc3c[nH]c4cccc(C1=C[C@H](CN2C)C(=O)N(CC)CC)c34
: