Target
5-hydroxytryptamine receptor 2C
Ligand
BDBM28574
Substrate
BDBM28582
Meas. Tech.
Radioligand Binding Assay (Ki)
pH
7.4±n/a
Temperature
295.15±n/a K
Ki
>2000±n/a nM
Citation
 Liu, KGLo, JRComery, TAZhang, GMZhang, JYKowal, DMSmith, DLDi, LKerns, EHSchechter, LERobichaud, AJ 1-Sulfonylindazoles as potent and selective 5-HT6 ligands. Bioorg Med Chem Lett 19:2413-5 (2009)  
Target
Name:
5-hydroxytryptamine receptor 2C
Synonyms:
5-HT-2C 5-HT2C-INI 5-HTR2C 5-hydroxytryptamine receptor 2C (5-HT-2C) 5HT-1C HTR1C Serotonin (5-HT3) receptor Serotonin Receptor 2C
Type:
G Protein-Coupled Receptor (GPCR)
Mol. Mass.:
51836.79
Organism:
Homo sapiens (Human)
Description:
P28335
Residue:
458
  
Inhibitor
Name:
BDBM28574
Synonyms:
1-sulfonylindazole, 6c | 3-amino-N-[1-(naphthalene-1-sulfonyl)-1H-indazol-6-yl]propanamide
Type:
Small organic molecule
Emp. Form.:
C20H18N4O3S
Mol. Mass.:
394.447
SMILES:
NCCC(=O)Nc1ccc2cnn(c2c1)S(=O)(=O)c1cccc2ccccc12
:
Substrate
Name:
BDBM28582
Synonyms:
1-(4-iodo-2,5-dimethoxyphenyl)propan-2-amine DOI DOI,(-) [125I]4-iodo-2,5-dimethoxyphenylisopropylamine | [125I]DOI
Type:
radiolabeled ligand
Emp. Form.:
C11H16INO2
Mol. Mass.:
321.1547
SMILES:
COc1cc(CC(C)N)c(OC)cc1I
: