Target
Dimer of Gag-Pol polyprotein [489-587]
Ligand
BDBM381
Substrate
Peptide substrate
Meas. Tech.
Protease Inhibition Assay
pH
5.5±n/a
Temperature
303.15±n/a K
IC50
30±n/a nM
Citation
 Ghosh, AKThompson, WJLee, HYMcKee, SPMunson, PMDuong, TTDarke, PLZugay, JAEmini, EASchleif, WA Cyclic sulfolanes as novel and high affinity P2 ligands for HIV-1 protease inhibitors. J Med Chem 36:924-7 (1993)  
Target
Name:
Dimer of Gag-Pol polyprotein [489-587]
Synonyms:
HIV-1 Protease
Type:
Protein Complex
Mol. Mass.:
Description:
Components:
This complex has 2 components.
Component 1
Name:
Gag-Pol polyprotein [489-587]
Synonyms:
HIV protease HIV-1 Protease chain A POL_HV1N5 | gag-pol
Type:
Enzyme Subunit
Mol. Mass.:
10822.21
Organism:
Human immunodeficiency virus type 1
Description:
P12497[489-587]
Residue:
99
  
Component 2
Name:
Gag-Pol polyprotein [489-587]
Synonyms:
HIV protease HIV-1 Protease chain A POL_HV1N5 | gag-pol
Type:
Enzyme Subunit
Mol. Mass.:
10822.21
Organism:
Human immunodeficiency virus type 1
Description:
P12497[489-587]
Residue:
99
  
Inhibitor
Name:
BDBM381
Synonyms:
(2R,3R)-2-(2-methylpropyl)-1,1-dioxo--thiolan-3-yl N-[(2S,3R)-4-[(4aS,8aS)-3-(tert-butylcarbamoyl)-decahydroisoquinolin-2-yl]-3-hydroxy-1-phenylbutan-2-yl]carbamate | Sulfone Deriv. 14
Type:
Small organic molecule
Emp. Form.:
C33H53N3O6S
Mol. Mass.:
619.855
SMILES:
[H][C@@]12CCCC[C@]1([H])CN(C[C@@H](O)[C@H](Cc1ccccc1)NC(=O)O[C@@H]1CCS(=O)(=O)[C@@H]1CC(C)C)C(C2)C(=O)NC(C)(C)C
:
Substrate
Name:
Peptide substrate
Synonyms:
Type:
Peptide
Mol. Mass.:
4618.57
Organism:
Description:
Residue:
43