Target
Lethal factor
Ligand
BDBM28904
Substrate
MAPKKide
Meas. Tech.
MAPKKide Assay
IC50
5710±n/a nM
Citation
 Johnson, SLChen, LHHarbach, RSabet, MSavinov, ACotton, NJStrongin, AGuiney, DPellecchia, M Rhodanine derivatives as selective protease inhibitors against bacterial toxins. Chem Biol Drug Des 71:131-9 (2008)  
Target
Name:
Lethal factor
Synonyms:
Anthrax Lethal Factor (LF) Antrax lethal toxin lef | lethal factor
Type:
PROTEIN
Mol. Mass.:
93758.56
Organism:
Bacillus anthracis
Description:
ChEMBL_1460338
Residue:
809
  
Inhibitor
Name:
BDBM28904
Synonyms:
2-{5-[(3Z)-1-{[(3-methylphenyl)carbamoyl]methyl}-2-oxo-2,3-dihydro-1H-indol-3-ylidene]-4-oxo-2-sulfanylidene-1,3-thiazolidin-3-yl}acetic acid | rhodanine derivative, 63
Type:
Small organic molecule
Emp. Form.:
C22H17N3O5S2
Mol. Mass.:
467.517
SMILES:
Cc1cccc(NC(=O)CN2C(=O)\C(=C3/SC(=S)N(CC(O)=O)C3=O)c3ccccc23)c1
:
Substrate
Name:
MAPKKide
Synonyms:
Type:
Peptide
Mol. Mass.:
358.43
Organism:
Description:
MAPPKKide is a quenched fluoresent substrate peptide based on fluorescence resonance energy transfer (FRET). The C-terminally linked fluorophore of MAPKKide is a FITC, and the acceptor chromophore is 4-([4-(dimethylamino)-phenyl] azo) benzoic acid (DABCYL) (List Biological Laboratories, Inc, Campbell, CA).
Residue:
3
NA