Target
D(2) dopamine receptor
Ligand
BDBM301849
Substrate
Meas. Tech.
Radioligand Binding Assay
Ki
331±51.9 nM
Citation
 Ananthan, S Urea and amide derivatives of aminoalkylpiperazines and use thereof US Patent  US9969743 Publication Date 5/15/2018 
Target
Name:
D(2) dopamine receptor
Synonyms:
D(2) dopamine receptor DOPAMINE D2 Long DRD2 Dopamine D2 receptor Dopamine D2 receptor (D2R) Dopamine2-like | d2
Type:
Cell-surface receptors
Mol. Mass.:
50647.10
Organism:
Homo sapiens (Human)
Description:
P14416
Residue:
443
  
Inhibitor
Name:
BDBM301849
Synonyms:
N-(4-(4-(2-(tert-Butyl)-6-(trifluoromethyl)pyrimidin-4-yl)piperazin-1-yl)butyl)-4-cyclopropylpiperazine-1-carboxamide US9969743, 35
Type:
Small organic molecule
Emp. Form.:
C25H40F3N7O
Mol. Mass.:
511.6266
SMILES:
CC(C)(C)c1nc(cc(n1)C(F)(F)F)N1CCN(CCCCNC(=O)N2CCN(CC2)C2CC2)CC1
: