Target
5-hydroxytryptamine receptor 7
Ligand
BDBM29565
Substrate
BDBM21392
Meas. Tech.
Radioligand Binding Assay (Ki)
pH
7.4±n/a
Temperature
310.15±n/a K
Ki
335±22 nM
Citation
 Paluchowska, MHBugno, RDuszyńska, BTatarczyńska, ENikiforuk, ALenda, TChojnacka-Wójcik, E The influence of modifications in imide fragment structure on 5-HT(1A) and 5-HT(7) receptor affinity and in vivo pharmacological properties of some new 1-(m-trifluoromethylphenyl)piperazines. Bioorg Med Chem 15:7116-25 (2007)  
Target
Name:
5-hydroxytryptamine receptor 7
Synonyms:
5-HT-7 5-HT7 5-HT7S 5HT7 HTR7 | Serotonin receptor 7
Type:
G Protein-Coupled Receptor (GPCR)
Mol. Mass.:
53573.08
Organism:
Homo sapiens (Human)
Description:
P34969
Residue:
479
  
Inhibitor
Name:
BDBM29565
Synonyms:
1-(m-trifluorophenyl)piperazine, 12
Type:
Small organic molecule
Emp. Form.:
C25H30F3N3O2
Mol. Mass.:
461.5198
SMILES:
FC(F)(F)c1cccc(c1)N1CCN(CC1)C1CCC(CC1)N1C(=O)C2CC=CCC2C1=O
:
Substrate
Name:
BDBM21392
Synonyms:
3-(2-aminoethyl)-1H-indole-5-carboxamide 5-CT,DP CHEMBL1256863 [3H]-5-CT [3H]-5-Carboxyamidotryptamine | [3H]-5-carboxamidotryptamine
Type:
Small organic molecule
Emp. Form.:
C11H13N3O
Mol. Mass.:
203.2404
SMILES:
NCCc1c[nH]c2ccc(cc12)C(N)=O
: