Target
D(2) dopamine receptor
Ligand
BDBM29566
Substrate
BDBM21397
Meas. Tech.
Radioligand Binding Assay (Ki)
Ki
4370±n/a nM
Citation
 Paluchowska, MHBugno, RDuszyńska, BTatarczyńska, ENikiforuk, ALenda, TChojnacka-Wójcik, E The influence of modifications in imide fragment structure on 5-HT(1A) and 5-HT(7) receptor affinity and in vivo pharmacological properties of some new 1-(m-trifluoromethylphenyl)piperazines. Bioorg Med Chem 15:7116-25 (2007)  
Target
Name:
D(2) dopamine receptor
Synonyms:
DOPAMINE D2 DOPAMINE D2 Short Dopamine D2 receptor Drd2
Type:
G Protein-Coupled Receptor (GPCR)
Mol. Mass.:
50931.60
Organism:
Rattus norvegicus (rat)
Description:
P61169
Residue:
444
  
Inhibitor
Name:
BDBM29566
Synonyms:
1-(m-trifluorophenyl)piperazine, 13
Type:
Small organic molecule
Emp. Form.:
C21H26F3N3O2
Mol. Mass.:
409.4452
SMILES:
CC1=C(C)C(=O)N(CCCCN2CCN(CC2)c2cccc(c2)C(F)(F)F)C1=O
:
Substrate
Name:
BDBM21397
Synonyms:
8-[4-(4-fluorophenyl)-4-keto-butyl]-1-phenyl-1,3,8-triazaspiro[4.5]decan-4-one 8-[4-(4-fluorophenyl)-4-oxobutyl]-1-phenyl-1,3,8-triazaspiro[4.5]decan-4-one MLS000028615 SPIPERONE US9359372, Spiperone cid_5265
Type:
radiolabeled ligand
Emp. Form.:
C23H26FN3O2
Mol. Mass.:
395.4698
SMILES:
Fc1ccc(cc1)C(=O)CCCN1CCC2(CC1)N(CNC2=O)c1ccccc1
: