Target
Dimer of Gag-Pol polyprotein [489-587]
Ligand
BDBM556
Substrate
Peptide Substrate
Meas. Tech.
Protease Inhibition Assay
pH
5±n/a
Temperature
295.15±n/a K
Ki
0.10±n/a nM
Citation
 Thaisrivongs, SSkulnick, HITurner, SRStrohbach, JWTommasi, RAJohnson, PDAristoff, PAJudge, TMGammill, RBMorris, JKRomines, KRChrusciel, RAHinshaw, RRChong, KTTarpley, WGPoppe, SMSlade, DELynn, JCHorng, MMTomich, PKSeest, EPDolak, LAHowe, WJHoward, GMWatenpaugh, KD Structure-based design of HIV protease inhibitors: sulfonamide-containing 5,6-dihydro-4-hydroxy-2-pyrones as non-peptidic inhibitors. J Med Chem 39:4349-53 (1996)  
Target
Name:
Dimer of Gag-Pol polyprotein [489-587]
Synonyms:
HIV-1 Protease
Type:
Tandem linked enzyme construct
Mol. Mass.:
Description:
Components:
This complex has 2 components.
Component 1
Name:
Gag-Pol polyprotein [489-587]
Synonyms:
Human immunodeficiency virus type 1 protease Pol polyprotein | gag-pol
Type:
Enzyme Subunit
Mol. Mass.:
10781.16
Organism:
Human immunodeficiency virus type 1
Description:
P04585[489-587]
Residue:
99
  
Component 2
Name:
Gag-Pol polyprotein [489-587]
Synonyms:
Human immunodeficiency virus type 1 protease Pol polyprotein | gag-pol
Type:
Enzyme Subunit
Mol. Mass.:
10781.16
Organism:
Human immunodeficiency virus type 1
Description:
P04585[489-587]
Residue:
99
  
Inhibitor
Name:
BDBM556
Synonyms:
5-cyano-N-{3-[(1S)-1-[(6R)-4-hydroxy-2-oxo-6-(2-phenylethyl)-6-propyl-5,6-dihydro-2H-pyran-3-yl]propyl]phenyl}pyridine-2-sulfonamide Tipranavir analog 13
Type:
Small organic molecule
Emp. Form.:
C31H33N3O5S
Mol. Mass.:
559.676
SMILES:
CCC[C@@]1(CCc2ccccc2)CC(=O)C([C@@H](CC)c2cccc(NS(=O)(=O)c3ccc(cn3)C#N)c2)C(=O)O1
:
Substrate
Name:
Peptide Substrate
Synonyms:
Type:
Peptide
Mol. Mass.:
1447.64
Organism:
Description:
The peptide was derivatized with biotin and fluorescein isothiocyanate at the amino and carboxy termini.
Residue:
12
RVSQNYPIVQNK