Target
Beta-secretase 1
Ligand
BDBM29777
Substrate
Fluorescent Substrate
Meas. Tech.
Enzyme Inhibition Assay
pH
4.5±n/a
Temperature
295.15±n/a K
IC50
7±n/a nM
Citation
 Charrier, NClarke, BDemont, EDingwall, CDunsdon, RHawkins, JHubbard, JHussain, IMaile, GMatico, RMosley, JNaylor, AO'Brien, ARedshaw, SRowland, PSoleil, VSmith, KJSweitzer, STheobald, PVesey, DWalter, DSWayne, G Second generation of BACE-1 inhibitors part 2: Optimisation of the non-prime side substituent. Bioorg Med Chem Lett 19:3669-73 (2009)  
Target
Name:
Beta-secretase 1
Synonyms:
ASP2 Aspartyl protease 2 BACE1 Beta-secretase (BACE) Beta-secretase 1 (BACE 1) Beta-secretase 1 (BACE1) Beta-site amyloid precursor protein cleaving enzyme 1 Memapsin-2 beta-Secretase (BACE-1) | beta-Secretase (BACE1)
Type:
Protein
Mol. Mass.:
55755.10
Organism:
Homo sapiens (Human)
Description:
P56817
Residue:
501
  
Inhibitor
Name:
BDBM29777
Synonyms:
7,6,5 tricyclic sulfonamide, 15 | BMCL193674 Compound 8
Type:
Small organic molecule
Emp. Form.:
C27H33F3N4O4S
Mol. Mass.:
566.636
SMILES:
CCc1cn2CCS(=O)(=O)N(C)c3cc(cc1c23)C(=O)N[C@@H](Cc1ccccc1)[C@H](O)CNCCC(F)(F)F
:
Substrate
Name:
Fluorescent Substrate
Synonyms:
Type:
Peptide
Mol. Mass.:
2030.30
Organism:
Description:
Residue:
18
FAMSEVNLDAEFKTAMRA