Target
Beta-secretase 1
Ligand
BDBM29779
Substrate
Fluorescent Substrate
Meas. Tech.
Enzyme Inhibition Assay
pH
4.5±n/a
Temperature
295.15±n/a K
IC50
550±n/a nM
Citation
 Charrier, NClarke, BDemont, EDingwall, CDunsdon, RHawkins, JHubbard, JHussain, IMaile, GMatico, RMosley, JNaylor, AO'Brien, ARedshaw, SRowland, PSoleil, VSmith, KJSweitzer, STheobald, PVesey, DWalter, DSWayne, G Second generation of BACE-1 inhibitors part 2: Optimisation of the non-prime side substituent. Bioorg Med Chem Lett 19:3669-73 (2009)  
Target
Name:
Beta-secretase 1
Synonyms:
ASP2 Aspartyl protease 2 BACE1 Beta-secretase (BACE) Beta-secretase 1 (BACE 1) Beta-secretase 1 (BACE1) Beta-site amyloid precursor protein cleaving enzyme 1 Memapsin-2 beta-Secretase (BACE-1) | beta-Secretase (BACE1)
Type:
Protein
Mol. Mass.:
55755.10
Organism:
Homo sapiens (Human)
Description:
P56817
Residue:
501
  
Inhibitor
Name:
BDBM29779
Synonyms:
7,6,6 tricyclic sulfonamide, 19
Type:
Small organic molecule
Emp. Form.:
C27H39N5O4S
Mol. Mass.:
529.695
SMILES:
CCN1CCN2CCS(=O)(=O)N(C)C3C=C(C=C1C23)C(=O)N[C@@H](Cc1ccccc1)[C@H](O)CNC1CC1
:
Substrate
Name:
Fluorescent Substrate
Synonyms:
Type:
Peptide
Mol. Mass.:
2030.30
Organism:
Description:
Residue:
18
FAMSEVNLDAEFKTAMRA