Target
Nociceptin receptor
Ligand
BDBM29985
Substrate
BDBM29961
Meas. Tech.
In Vitro Binding Assay (IC50) and In Vitro Agonism/Antagonism Measurements (EC50/IC50)
IC50
1.1±n/a nM
EC50
1.2±n/a nM
Citation
 Kobayashi, KUchiyama, MIto, HTakahashi, HYoshizumi, TSakoh, HNagatomi, YAsai, MMiyazoe, HTsujita, THirayama, MOzaki, STani, TIshii, YOhta, HOkamoto, O Discovery of novel arylpyrazole series as potent and selective opioid receptor-like 1 (ORL1) antagonists. Bioorg Med Chem Lett 19:3627-31 (2009)  
Target
Name:
Nociceptin receptor
Synonyms:
KOR-3 Mu-type opioid receptor (Mu) Nociceptin Receptor (ORL1 Receptor) Nociceptin receptor (ORL-1) Nociceptin/Orphanin FQ, NOP receptor OPIATE ORL-1 OPRL1 protein ORL1 Opioid receptor like-1 Orphanin FQ receptor (ORL1) | P41146
Type:
G Protein-Coupled Receptor (GPCR)
Mol. Mass.:
40702.87
Organism:
Homo sapiens (Human)
Description:
P41146
Residue:
370
  
Inhibitor
Name:
BDBM29985
Synonyms:
arylpyrazole, 30
Type:
Small organic molecule
Emp. Form.:
C21H23ClFN5
Mol. Mass.:
399.892
SMILES:
Cc1c(CNC2CCCC2)nn(c1-c1cnc(C)c(F)c1)-c1ncccc1Cl
:
Substrate
Name:
BDBM29961
Synonyms:
[125I]Tyr14-NC/OFQ | [125I]Tyr14-Nociceptin
Type:
radiolabeled substrate
Emp. Form.:
Mol. Mass.:
SMILES:
: