Target
Nociceptin receptor
Ligand
BDBM30008
Substrate
BDBM29961
Meas. Tech.
In Vitro Binding Assay (IC50) and In Vitro Agonism/Antagonism Measurements (EC50/IC50)
pH
7.4±n/a
Temperature
310.15±n/a K
IC50
1.9±n/a nM
EC50
1.1±n/a nM
Citation
 Kobayashi, KKato, TYamamoto, IShimizu, AMizutani, SAsai, MKawamoto, HIto, SYoshizumi, THirayama, MOzaki, SOhta, HOkamoto, O Optimization of benzimidazole series as opioid receptor-like 1 (ORL1) antagonists: SAR study directed toward improvement of selectivity over hERG activity. Bioorg Med Chem Lett 19:3100-3 (2009)  
Target
Name:
Nociceptin receptor
Synonyms:
KOR-3 Mu-type opioid receptor (Mu) Nociceptin Receptor (ORL1 Receptor) Nociceptin receptor (ORL-1) Nociceptin/Orphanin FQ, NOP receptor OPIATE ORL-1 OPRL1 protein ORL1 Opioid receptor like-1 Orphanin FQ receptor (ORL1) | P41146
Type:
G Protein-Coupled Receptor (GPCR)
Mol. Mass.:
40702.87
Organism:
Homo sapiens (Human)
Description:
P41146
Residue:
370
  
Inhibitor
Name:
BDBM30008
Synonyms:
benzimidazole analogue, 7g
Type:
Small organic molecule
Emp. Form.:
C22H32ClN5OS
Mol. Mass.:
450.04
SMILES:
CCN1CCN(CC1)c1cc2[nH]c(S[C@@]3(C)CC[C@@H](CC3)NC(C)=O)nc2cc1Cl
:
Substrate
Name:
BDBM29961
Synonyms:
[125I]Tyr14-NC/OFQ | [125I]Tyr14-Nociceptin
Type:
radiolabeled substrate
Emp. Form.:
Mol. Mass.:
SMILES:
: