Target
Sodium-dependent serotonin transporter
Ligand
BDBM22418
Substrate
BDBM22166
Meas. Tech.
Radioligand Binding Assay (Ki) and Inhibition of Substrate Uptake (EC50/IC50)
pH
7.4±n/a
Temperature
295.15±n/a K
Ki
276±87 nM
EC50
416±135 nM
Citation
 Cashman, JRVoelker, TZhang, HTO'Donnell, JM Dual inhibitors of phosphodiesterase-4 and serotonin reuptake. J Med Chem 52:1530-9 (2009)  
Target
Name:
Sodium-dependent serotonin transporter
Synonyms:
5-HT Transporter 5HTT SC6A4_HUMAN SLC6A4 Serotonin transporter (5HTT) Sodium-dependent serotonin transporter (SERT) | Solute carrier family 6 member 4
Type:
Multi-pass membrane protein
Mol. Mass.:
70322.51
Organism:
Homo sapiens (Human)
Description:
P31645
Residue:
630
  
Inhibitor
Name:
BDBM22418
Synonyms:
Cocaine methyl (1R,2R,3S,5S)-3-(benzoyloxy)-8-methyl-8-azabicyclo[3.2.1]octane-2-carboxylate | methyl (1R,2R,3S,5S)-8-methyl-3-[(phenylcarbonyl)oxy]-8-azabicyclo[3.2.1]octane-2-carboxylate
Type:
Emp. Form.:
C17H21NO4
Mol. Mass.:
303.3529
SMILES:
[H][C@]12CC[C@]([H])([C@H]([C@H](C1)OC(=O)c1ccccc1)C(=O)OC)N2C
:
Substrate
Name:
BDBM22166
Synonyms:
3-(4-iodophenyl)tropane-2-carboxylic acid methyl ester CHEMBL215376 RTI-258 [125I]RTI-55 | methyl (1R,2S,3S,5S)-3-(4-iodophenyl)-8-methyl-8-azabicyclo[3.2.1]octane-2-carboxylate
Type:
radiolabeled ligand
Emp. Form.:
C16H20INO2
Mol. Mass.:
385.24
SMILES:
[H][C@]12CC[C@]([H])([C@H]([C@H](C1)c1ccc(I)cc1)C(=O)OC)N2C
: