Target
Genome polyprotein
Ligand
BDBM30415
Substrate
biotinylated oligo (rG13)/poly rC
Meas. Tech.
NS5B Polymerase Inhibition Assay (IC50) and HCV Replicon Assay (EC50)
pH
7.5±n/a
Temperature
301.15±n/a K
IC50
<10±n/a nM
EC50
5±n/a nM
Citation
 Ruebsam, FWebber, SETran, MTTran, CVMurphy, DEZhao, JDragovich, PSKim, SHLi, LSZhou, YHan, QKissinger, CRShowalter, RELardy, MShah, AMTsan, MPatel, RLebrun, LAKamran, RSergeeva, MVBartkowski, DMNolan, TGNorris, DAKirkovsky, L Pyrrolo[1,2-b]pyridazin-2-ones as potent inhibitors of HCV NS5B polymerase. Bioorg Med Chem Lett 18:3616-21 (2008)  
Target
Name:
Genome polyprotein
Synonyms:
Genome polyprotein POLG_HCVBK | RNA-directed RNA polymerase (NS5B)
Type:
Protein
Mol. Mass.:
327252.46
Organism:
Hepatitis C virus genotype 1b (isolate BK) (HCV)
Description:
P26663
Residue:
3010
  
Inhibitor
Name:
BDBM30415
Synonyms:
pyrrolo[1,2-b]pyridazin-2-one analog., 3h
Type:
Small organic molecule
Emp. Form.:
C21H25N5O6S2
Mol. Mass.:
507.583
SMILES:
CC(C)(C)CCn1n2cccc2c(O)c(C2=Nc3ccc(NS(C)(=O)=O)cc3S(=O)(=O)N2)c1=O
:
Substrate
Name:
biotinylated oligo (rG13)/poly rC
Synonyms:
Type:
RNA
Mol. Mass.:
358.43
Organism:
Description:
[alpha-33P]GTP/GTP as co-substrate.
Residue:
3
NA