Target
Discoidin domain-containing receptor 2 [A642S]
Ligand
BDBM21
Substrate
biotinylated affinity ligand
Meas. Tech.
Kinase Inhibitor Selectivity Profiling Assay
pH
7.4±n/a
Temperature
298.15±n/a K
Kd
320±n/a nM
Citation
 PubChem, PC Kinase Inhibitor Selectivity Profiling Assay PubChem Bioassay (2008)[AID] 
Target
Name:
Discoidin domain-containing receptor 2 [A642S]
Synonyms:
CD167 antigen-like family member B DDR2_HUMAN NTRKR3 Receptor protein-tyrosine kinase TKT TYRO10 Tyrosine-protein kinase TYRO10
Type:
Tyrosine-protein kinase
Mol. Mass.:
96733.07
Organism:
Homo sapiens (Human)
Description:
gi_433338
Residue:
855
  
Inhibitor
Name:
BDBM21
Synonyms:
CHEMBL24828 VANDETANIB ZD6474 | cid_3081361
Type:
Emp. Form.:
C22H24BrFN4O2
Mol. Mass.:
475.354
SMILES:
COc1cc2c(Nc3ccc(Br)cc3F)ncnc2cc1OCC1CCN(C)CC1
:
Substrate
Name:
biotinylated affinity ligand
Synonyms:
Type:
Mol. Mass.:
358.43
Organism:
Description:
Residue:
3
NA