Target
Epidermal growth factor receptor [G719C]
Ligand
BDBM21
Substrate
biotinylated affinity ligand
Meas. Tech.
Kinase Inhibitor Selectivity Profiling Assay
pH
7.4±n/a
Temperature
298.15±n/a K
Kd
9.6±n/a nM
Citation
 PubChem, PC Kinase Inhibitor Selectivity Profiling Assay PubChem Bioassay (2008)[AID] 
Target
Name:
Epidermal growth factor receptor [G719C]
Synonyms:
EGF-R Tyrosine Kinase Mutant (G719C) EGFR (G719C) ERBB Epidermal growth factor receptor (EGFR)(G719C) | HER1
Type:
Tyrosine-protein kinase
Mol. Mass.:
134325.68
Organism:
Homo sapiens (Human)
Description:
gi_29725609
Residue:
1210
  
Inhibitor
Name:
BDBM21
Synonyms:
CHEMBL24828 VANDETANIB ZD6474 | cid_3081361
Type:
Emp. Form.:
C22H24BrFN4O2
Mol. Mass.:
475.354
SMILES:
COc1cc2c(Nc3ccc(Br)cc3F)ncnc2cc1OCC1CCN(C)CC1
:
Substrate
Name:
biotinylated affinity ligand
Synonyms:
Type:
Mol. Mass.:
358.43
Organism:
Description:
Residue:
3
NA