Target
Mast/stem cell growth factor receptor Kit
Ligand
BDBM25118
Substrate
biotinylated affinity ligand
Meas. Tech.
Kinase Inhibitor Selectivity Profiling Assay
Ki
7200±n/a nM
Citation
 PubChem, PC Kinase Inhibitor Selectivity Profiling Assay PubChem Bioassay (2008)[AID] 
Target
Name:
Mast/stem cell growth factor receptor Kit
Synonyms:
CD117 antigen KIT Mast/stem cell growth factor receptor Kit (cKIT) Proto-oncogene tyrosine-protein kinase Kit Stem cell growth factor receptor Tyrosine-protein kinase Kit c-kit v-kit Hardy-Zuckerman 4 feline sarcoma viral oncogene homolog
Type:
Protein
Mol. Mass.:
109869.37
Organism:
Homo sapiens (Human)
Description:
P10721
Residue:
976
  
Inhibitor
Name:
BDBM25118
Synonyms:
(3Z)-4-amino-5-fluoro-3-[5-(4-methylpiperazino)-1,3-dihydrobenzimidazol-2-ylidene]carbostyril CHEMBL522892 | CHIR-258
Type:
Small organic molecule
Emp. Form.:
C21H21FN6O
Mol. Mass.:
392.4294
SMILES:
CN1CCN(CC1)c1ccc2nc([nH]c2c1)-c1c(N)c2c(F)cccc2[nH]c1=O
:
Substrate
Name:
biotinylated affinity ligand
Synonyms:
Type:
Mol. Mass.:
358.43
Organism:
Description:
Residue:
3
NA