Target
E3 ubiquitin-protein ligase Mdm2
Ligand
BDBM31306
Substrate
Fl 9mer
Meas. Tech.
Fluorescent Peptide Displacement Assay
pH
7.4±n/a
Temperature
296.15±n/a K
IC50
2700±n/a nM
Citation
 Marugan, JJLeonard, KRaboisson, PGushue, JMCalvo, RKoblish, HKLattanze, JZhao, SCummings, MDPlayer, MRSchubert, CMaroney, ACLu, T Enantiomerically pure 1,4-benzodiazepine-2,5-diones as Hdm2 antagonists. Bioorg Med Chem Lett 16:3115-20 (2006)  
Target
Name:
E3 ubiquitin-protein ligase Mdm2
Synonyms:
Double minute 2 protein E3 ubiquitin-protein ligase Mdm2 (p53-binding protein Mdm2) Human Double Minute 2 (HDM2) MDM2-MDMX p53-Binding Protein MDM2 | p53-binding protein
Type:
Oncoprotein
Mol. Mass.:
55196.54
Organism:
Homo sapiens (Human)
Description:
Q00987
Residue:
491
  
Inhibitor
Name:
BDBM31306
Synonyms:
1,4-benzodiazepine-2,5-dione, 12c
Type:
Small organic molecule
Emp. Form.:
C29H28Cl2IN3O3
Mol. Mass.:
664.361
SMILES:
C[C@@H](N1[C@@H](c2ccc(Cl)cc2)C(=O)N(CCN2CCOCC2)c2ccc(I)cc2C1=O)c1ccc(Cl)cc1
:
Substrate
Name:
Fl 9mer
Synonyms:
Type:
fluorescent peptide
Mol. Mass.:
2263.48
Organism:
Description:
Residue:
18
FLRESCEINFMDYWEGLN